Target
Metabotropic glutamate receptor 5
Ligand
BDBM50323925
Substrate
Meas. Tech.
ChEMBL_647203 (CHEMBL1217344)
Ki
36±n/a nM
Citation
 Baumann, CAMu, LWertli, NKrämer, SDHoner, MSchubiger, PAAmetamey, SM Syntheses and pharmacological characterization of novel thiazole derivatives as potential mGluR5 PET ligands. Bioorg Med Chem 18:6044-54 (2010)  
Target
Name:
Metabotropic glutamate receptor 5
Synonyms:
GRM5_RAT Grm5 Mglur5 metabotropic glutamate 5/1-C metabotropic glutamate 5a
Type:
Enzyme
Mol. Mass.:
131900.14
Organism:
Rattus norvegicus (Rat)
Description:
P31424
Residue:
1203
  
Inhibitor
Name:
BDBM50323925
Synonyms:
(E)-3-(Thiazol-4-ylethynyl)cyclohex-2-enone O-2-(2-fluoroethoxy)ethyl oxime | CHEMBL1214362
Type:
Small organic molecule
Emp. Form.:
C15H17FN2O2S
Mol. Mass.:
308.371
SMILES:
FCCOCCO\N=C1/CCCC(=C1)C#Cc1cscn1
: