Target
Monoglyceride lipase
Ligand
BDBM50128581
Substrate
Meas. Tech.
ChEMBL_650749 (CHEMBL1227509)
IC50
200000±n/a nM
Citation
 Long, JZLi, WBooker, LBurston, JJKinsey, SGSchlosburg, JEPavón, FJSerrano, AMSelley, DEParsons, LHLichtman, AHCravatt, BF Selective blockade of 2-arachidonoylglycerol hydrolysis produces cannabinoid behavioral effects. Nat Chem Biol 5:37-44 (2008)  
Target
Name:
Monoglyceride lipase
Synonyms:
MAGL Mgl2 Monoacylglycerol lipase Monoglyceride lipase (MGL)
Type:
Enzyme
Mol. Mass.:
33505.38
Organism:
Rattus norvegicus (Rat)
Description:
Q8R431
Residue:
303
  
Inhibitor
Name:
BDBM50128581
Synonyms:
Biphenyl-3-yl-carbamic acid cyclohexyl ester URB602 cyclohexyl biphenyl-3-ylcarbamate
Type:
Small organic molecule
Emp. Form.:
C19H21NO2
Mol. Mass.:
295.3755
SMILES:
O=C(Nc1cccc(c1)-c1ccccc1)OC1CCCCC1
: