Target
Monoglyceride lipase
Ligand
BDBM60622
Substrate
Meas. Tech.
ChEMBL_650758 (CHEMBL1227518)
IC50
6±n/a nM
Citation
 Long, JZLi, WBooker, LBurston, JJKinsey, SGSchlosburg, JEPavón, FJSerrano, AMSelley, DEParsons, LHLichtman, AHCravatt, BF Selective blockade of 2-arachidonoylglycerol hydrolysis produces cannabinoid behavioral effects. Nat Chem Biol 5:37-44 (2008)  
Target
Name:
Monoglyceride lipase
Synonyms:
HU-K5 Lysophospholipase-like MGL MGLL_HUMAN
Type:
Hydrolase
Mol. Mass.:
33264.56
Organism:
Homo sapiens (Human)
Description:
Human recombinant MGL (Cayman Chemical, cat# 10008354).
Residue:
303
  
Inhibitor
Name:
BDBM60622
Synonyms:
BDBM50300355 US9133148, A
Type:
Emp. Form.:
C27H24N2O9
Mol. Mass.:
520.4875
SMILES:
OC(C1CCN(CC1)C(=O)Oc1ccc(cc1)[N+]([O-])=O)(c1ccc2OCOc2c1)c1ccc2OCOc2c1
: