Target
D(3) dopamine receptor
Ligand
BDBM50324861
Substrate
Meas. Tech.
ChEMBL_651490 (CHEMBL1227607)
IC50
1426±n/a nM
Citation
 Park, CMKim, SYPark, WKChoi, JHSeong, CM Synthesis and SAR of (piperazin-1-yl-phenyl)-arylsulfonamides: a novel series of atypical antipsychotic agents. Bioorg Med Chem Lett 20:5221-4 (2010)  
Target
Name:
D(3) dopamine receptor
Synonyms:
DOPAMINE D3 DRD3_HUMAN Dopamine D3 receptor (D3) Dopamine receptor Dopamine receptor D3
Type:
Mol. Mass.:
44243.43
Organism:
Homo sapiens (Human)
Description:
Residue:
400
  
Inhibitor
Name:
BDBM50324861
Synonyms:
CHEMBL1221449 | Naphthalene-2-sulfonicacid cyclopropylmethyl-[3-(4-methyl-piperazin-1-yl)-phenyl]-amide
Type:
Small organic molecule
Emp. Form.:
C25H29N3O2S
Mol. Mass.:
435.582
SMILES:
CN1CCN(CC1)c1cccc(c1)N(CC1CC1)S(=O)(=O)c1ccc2ccccc2c1
: