Target
D(2) dopamine receptor
Ligand
BDBM50324861
Substrate
Meas. Tech.
ChEMBL_651489 (CHEMBL1227606)
IC50
>10000±n/a nM
Citation
 Park, CMKim, SYPark, WKChoi, JHSeong, CM Synthesis and SAR of (piperazin-1-yl-phenyl)-arylsulfonamides: a novel series of atypical antipsychotic agents. Bioorg Med Chem Lett 20:5221-4 (2010)  
Target
Name:
D(2) dopamine receptor
Synonyms:
D(2) dopamine receptor DOPAMINE D2 Long DRD2 Dopamine D2 receptor Dopamine D2 receptor (D2R) Dopamine2-like | d2
Type:
Cell-surface receptors
Mol. Mass.:
50647.10
Organism:
Homo sapiens (Human)
Description:
P14416
Residue:
443
  
Inhibitor
Name:
BDBM50324861
Synonyms:
CHEMBL1221449 | Naphthalene-2-sulfonicacid cyclopropylmethyl-[3-(4-methyl-piperazin-1-yl)-phenyl]-amide
Type:
Small organic molecule
Emp. Form.:
C25H29N3O2S
Mol. Mass.:
435.582
SMILES:
CN1CCN(CC1)c1cccc(c1)N(CC1CC1)S(=O)(=O)c1ccc2ccccc2c1
: