Target
Beta-secretase 1
Ligand
BDBM17786
Substrate
Meas. Tech.
ChEMBL_651536 (CHEMBL1227788)
Ki
8±n/a nM
Citation
 Madden, JDod, JRGodemann, RKraemer, JSmith, MBiniszkiewicz, MHallett, DJBarker, JDyekjaer, JDHesterkamp, T Fragment-based discovery and optimization of BACE1 inhibitors. Bioorg Med Chem Lett 20:5329-33 (2010)  
Target
Name:
Beta-secretase 1
Synonyms:
ASP2 Aspartyl protease 2 BACE1 Beta-secretase (BACE) Beta-secretase 1 (BACE 1) Beta-secretase 1 (BACE1) Beta-site amyloid precursor protein cleaving enzyme 1 Memapsin-2 beta-Secretase (BACE-1) | beta-Secretase (BACE1)
Type:
Protein
Mol. Mass.:
55755.10
Organism:
Homo sapiens (Human)
Description:
P56817
Residue:
501
  
Inhibitor
Name:
BDBM17786
Synonyms:
(4S)-4-(2-amino-6-phenoxy-3,4-dihydroquinazolin-3-yl)-N,4-dicyclohexyl-N-methylbutanamide | 2-aminoquinazoline, 3a
Type:
Small organic molecule
Emp. Form.:
C31H42N4O2
Mol. Mass.:
502.6908
SMILES:
CN(C1CCCCC1)C(=O)CC[C@@H](C1CCCCC1)N1Cc2cc(Oc3ccccc3)ccc2N=C1N
: