Target
Cannabinoid receptor 1
Ligand
BDBM50325586
Substrate
Meas. Tech.
ChEMBL_652250 (CHEMBL1225453)
Ki
9±n/a nM
Citation
 Lange, JHAttali, Avan der Neut, MAWals, HCMulder, AZilaout, HDuursma, Avan Aken, HHvan Vliet, BJ Two distinct classes of novel pyrazolinecarboxamides as potent cannabinoid CB1 receptor agonists. Bioorg Med Chem Lett 20:4992-8 (2010)  
Target
Name:
Cannabinoid receptor 1
Synonyms:
CANN6 CB-R CNR CNR1_HUMAN Cannabinoid receptor Cannabinoid receptor 1 (brain)
Type:
G Protein-Coupled Receptor (GPCR)
Mol. Mass.:
52868.96
Organism:
Homo sapiens (Human)
Description:
P21554
Residue:
472
  
Inhibitor
Name:
BDBM50325586
Synonyms:
3-butyl-5,5-dimethyl-4-phenyl-N-(2-phenylpropan-2-yl)-4,5-dihydro-1H-pyrazole-1-carboxamide | CHEMBL1223716
Type:
Small organic molecule
Emp. Form.:
C25H33N3O
Mol. Mass.:
391.549
SMILES:
CCCCC1=NN(C(=O)NC(C)(C)c2ccccc2)C(C)(C)C1c1ccccc1
: