Target
Melanin-concentrating hormone receptor 1
Ligand
BDBM50325964
Substrate
Meas. Tech.
ChEMBL_654167 (CHEMBL1228973)
IC50
7579±n/a nM
Citation
 Sasmal, PKSasmal, SRao, PTVenkatesham, BRoshaiah, MAbbineni, CKhanna, IJadhav, VPSuresh, JTalwar, RMuzeeb, SReceveur, JMFrimurer, TMRist, ØElster, LHögberg, T Discovery of novel, orally available benzimidazoles as melanin concentrating hormone receptor 1 (MCHR1) antagonists. Bioorg Med Chem Lett 20:5443-8 (2010)  
Target
Name:
Melanin-concentrating hormone receptor 1
Synonyms:
G-protein coupled receptor 24 MCH receptor 1 MCH-R1 MCHR-1 MCHR1_HUMAN Melanin-Concentrating Hormone Receptor 1 (MCH1R) Melanin-concentrating hormone receptor 1 (MCH-1) Melanin-concentrating hormone receptor 1 (MCHR-1) SLC-1 Somatostatin receptor-like protein
Type:
G Protein-Coupled Receptor (GPCR)
Mol. Mass.:
45976.27
Organism:
Homo sapiens (Human)
Description:
Membranes from CHO-K1 cells stably expressing human MCH1R were used in assays.
Residue:
422
  
Inhibitor
Name:
BDBM50325964
Synonyms:
1-(4-chlorophenyl)-N-(3-(4-(3-(trifluoromethoxy)phenyl)piperidin-1-yl)propyl)-1H-benzo[d]imidazol-2-amine | CHEMBL1224080
Type:
Small organic molecule
Emp. Form.:
C28H28ClF3N4O
Mol. Mass.:
528.996
SMILES:
FC(F)(F)Oc1cccc(c1)C1CCN(CCCNc2nc3ccccc3n2-c2ccc(Cl)cc2)CC1
: