Target
Ribosomal protein S6 kinase beta-1
Ligand
BDBM3175
Substrate
Meas. Tech.
ChEMBL_660302 (CHEMBL1249798)
IC50
15±n/a nM
Citation
 Davies, SPReddy, HCaivano, MCohen, P Specificity and mechanism of action of some commonly used protein kinase inhibitors. Biochem J 351:95-105 (2001)  
Target
Name:
Ribosomal protein S6 kinase beta-1
Synonyms:
70 kDa ribosomal protein S6 kinase 1 70 kDa ribosomal protein kinase (p70S6K) Protein kinase 70S6K (T412E) RPS6KB1 Ribosomal protein S6 kinase I STK14A p70S6K1
Type:
Enzyme
Mol. Mass.:
59139.89
Organism:
Homo sapiens (Human)
Description:
His-tagged S6K1.
Residue:
525
  
Inhibitor
Name:
BDBM3175
Synonyms:
3-[1-[3-(Amidinothio)propyl]-3-indolyl]-4-(1-methyl-3-indolyl)-1H-pyrrole-2,5-dione Methanesulfonate Bisindolylmaleimide 11b CHEMBL6291 Ro 31-8220 [(3-{3-[4-(1-methyl-1H-indol-3-yl)-2,5-dioxo-2,5-dihydro-1H-pyrrol-3-yl]-1H-indol-1-yl}propyl)sulfanyl]methanimidamide
Type:
Small organic molecule
Emp. Form.:
C25H23N5O2S
Mol. Mass.:
457.547
SMILES:
Cn1cc(C2=C(C(=O)NC2=O)c2cn(CCCSC(N)=N)c3ccccc23)c2ccccc12
: