Target
Serine/threonine-protein kinase tousled-like 1
Ligand
BDBM50326053
Substrate
Meas. Tech.
ChEMBL_655960 (CHEMBL1245004)
Kd
>10000±n/a nM
Citation
 Zarrinkar, PPGunawardane, RNCramer, MDGardner, MFBrigham, DBelli, BKaraman, MWPratz, KWPallares, GChao, QSprankle, KGPatel, HKLevis, MArmstrong, RCJames, JBhagwat, SS AC220 is a uniquely potent and selective inhibitor of FLT3 for the treatment of acute myeloid leukemia (AML). Blood 114:2984-92 (2009)  
Target
Name:
Serine/threonine-protein kinase tousled-like 1
Synonyms:
KIAA0137 TLK1 | TLK1_HUMAN
Type:
Enzyme Catalytic Domain
Mol. Mass.:
86722.30
Organism:
Homo sapiens (Human)
Description:
gi_33636698
Residue:
766
  
Inhibitor
Name:
BDBM50326053
Synonyms:
CHEMBL608533 | PKC-412
Type:
Small organic molecule
Emp. Form.:
C35H30N4O4
Mol. Mass.:
570.6371
SMILES:
CO[C@@H]1[C@@H](C[C@H]2O[C@]1(C)n1c3ccccc3c3c4CNC(=O)c4c4c5ccccc5n2c4c13)N(C)C(=O)c1ccccc1
: