Target
SRSF protein kinase 2
Ligand
BDBM13535
Substrate
Meas. Tech.
ChEMBL_655941 (CHEMBL1244985)
Kd
>10000±n/a nM
Citation
 Zarrinkar, PPGunawardane, RNCramer, MDGardner, MFBrigham, DBelli, BKaraman, MWPratz, KWPallares, GChao, QSprankle, KGPatel, HKLevis, MArmstrong, RCJames, JBhagwat, SS AC220 is a uniquely potent and selective inhibitor of FLT3 for the treatment of acute myeloid leukemia (AML). Blood 114:2984-92 (2009)  
Target
Name:
SRSF protein kinase 2
Synonyms:
SFRS protein kinase 2 SRPK2 SRSF protein kinase 2 SRSF protein kinase 2 N-terminal Serine/threonine-protein kinase SRPK2
Type:
PROTEIN
Mol. Mass.:
77488.98
Organism:
Homo sapiens (Human)
Description:
ChEMBL_774248
Residue:
688
  
Inhibitor
Name:
BDBM13535
Synonyms:
4-[6-methoxy-7-(3-piperidin-1-ylpropoxy)quinazolin-4-yl]-N-(4-propan-2-yloxyphenyl)piperazine-1-carboxamide 4-[6-methoxy-7-[3-(1-piperidinyl)propoxy]-4-quinazolinyl]-N-(4-propan-2-yloxyphenyl)-1-piperazinecarboxamide CHEMBL124660 MLN518 cid_3038522
Type:
Small organic molecule
Emp. Form.:
C31H42N6O4
Mol. Mass.:
562.703
SMILES:
COc1cc2c(ncnc2cc1OCCCN1CCCCC1)N1CCN(CC1)C(=O)Nc1ccc(OC(C)C)cc1
: