Target
Beta-2 adrenergic receptor
Ligand
BDBM50326548
Substrate
Meas. Tech.
ChEMBL_658303 (CHEMBL1246860)
EC50
0.03±n/a nM
Citation
 Glossop, PALane, CAPrice, DABunnage, MELewthwaite, RAJames, KBrown, ADYeadon, MPerros-Huguet, CTrevethick, MAClarke, NPWebster, RJones, RMBurrows, JLFeeder, NTaylor, SCSpence, FJ Inhalation by design: novel ultra-long-actingß(2)-adrenoreceptor agonists for inhaled once-daily treatment of asthma and chronic obstructive pulmonary disease that utilize a sulfonamide agonist headgroup. J Med Chem 53:6640-52 (2010)  
Target
Name:
Beta-2 adrenergic receptor
Synonyms:
ADRB2 ADRB2_HUMAN Beta-2 adrenoceptor | Beta-2 adrenoreceptor
Type:
Mol. Mass.:
46461.69
Organism:
Homo sapiens (Human)
Description:
P07550
Residue:
413
  
Inhibitor
Name:
BDBM50326548
Synonyms:
CHEMBL1243348 | N-(cyclohexylmethyl)-2-(3-((R)-2-((R)-2-hydroxy-2-(4-hydroxy-3-(methylsulfonamido)phenyl)ethylamino)propyl)phenyl)acetamide
Type:
Small organic molecule
Emp. Form.:
C27H39N3O5S
Mol. Mass.:
517.681
SMILES:
C[C@H](Cc1cccc(CC(=O)NCC2CCCCC2)c1)NC[C@H](O)c1ccc(O)c(NS(C)(=O)=O)c1
: