Target
Bifunctional epoxide hydrolase 2
Ligand
BDBM50327844
Substrate
Meas. Tech.
ChEMBL_664904 (CHEMBL1259736)
IC50
0.4±n/a nM
Citation
 Rose, TEMorisseau, CLiu, JYInceoglu, BJones, PDSanborn, JRHammock, BD 1-Aryl-3-(1-acylpiperidin-4-yl)urea inhibitors of human and murine soluble epoxide hydrolase: structure-activity relationships, pharmacokinetics, and reduction of inflammatory pain. J Med Chem 53:7067-75 (2010)  
Target
Name:
Bifunctional epoxide hydrolase 2
Synonyms:
Cytosolic epoxide hydrolase 2 EPHX2 HYES_HUMAN Soluble epoxide hydrolase (sEH) | epoxide hydrolase 2, cytoplasmic
Type:
Enzyme
Mol. Mass.:
62613.07
Organism:
Homo sapiens (Human)
Description:
P34913
Residue:
555
  
Inhibitor
Name:
BDBM50327844
Synonyms:
1-(3,5-Dichlorophenyl)-3-(1-propionylpiperidin-4-yl)urea US9296693, 33
Type:
Small organic molecule
Emp. Form.:
C15H19Cl2N3O2
Mol. Mass.:
344.236
SMILES:
CCC(=O)N1CCC(CC1)NC(=O)Nc1cc(Cl)cc(Cl)c1
: