Target
Bifunctional epoxide hydrolase 2
Ligand
BDBM50327847
Substrate
Meas. Tech.
ChEMBL_664906 (CHEMBL1259738)
IC50
0.4±n/a nM
Citation
 Rose, TEMorisseau, CLiu, JYInceoglu, BJones, PDSanborn, JRHammock, BD 1-Aryl-3-(1-acylpiperidin-4-yl)urea inhibitors of human and murine soluble epoxide hydrolase: structure-activity relationships, pharmacokinetics, and reduction of inflammatory pain. J Med Chem 53:7067-75 (2010)  
Target
Name:
Bifunctional epoxide hydrolase 2
Synonyms:
Eph2 Epoxide hydratase Soluble epoxide hydrolase (sEH)
Type:
Enzyme
Mol. Mass.:
62512.06
Organism:
Mus musculus (Mouse)
Description:
P34914
Residue:
554
  
Inhibitor
Name:
BDBM50327847
Synonyms:
1-(1-(Trifluoroacetyl)piperidin-4-yl)-3-(4-(trifluoromethoxy)phenyl)urea US8501783, 1591 | US9296693, 53
Type:
Small organic molecule
Emp. Form.:
C15H15F6N3O3
Mol. Mass.:
399.2883
SMILES:
FC(F)(F)Oc1ccc(NC(=O)NC2CCN(CC2)C(=O)C(F)(F)F)cc1
: