Target
Bifunctional epoxide hydrolase 2
Ligand
BDBM50327851
Substrate
Meas. Tech.
ChEMBL_664904 (CHEMBL1259736)
IC50
0.5±n/a nM
Citation
 Rose, TEMorisseau, CLiu, JYInceoglu, BJones, PDSanborn, JRHammock, BD 1-Aryl-3-(1-acylpiperidin-4-yl)urea inhibitors of human and murine soluble epoxide hydrolase: structure-activity relationships, pharmacokinetics, and reduction of inflammatory pain. J Med Chem 53:7067-75 (2010)  
Target
Name:
Bifunctional epoxide hydrolase 2
Synonyms:
Cytosolic epoxide hydrolase 2 EPHX2 HYES_HUMAN Soluble epoxide hydrolase (sEH) | epoxide hydrolase 2, cytoplasmic
Type:
Enzyme
Mol. Mass.:
62613.07
Organism:
Homo sapiens (Human)
Description:
P34913
Residue:
555
  
Inhibitor
Name:
BDBM50327851
Synonyms:
1-(1-((4-Acetylpiperazin-1-yl)acetyl)piperidin-4-yl)-3-(4-(trifluoromethoxy)phenyl)urea US9296693, 51
Type:
Small organic molecule
Emp. Form.:
C21H28F3N5O4
Mol. Mass.:
471.4733
SMILES:
CC(=O)N1CCN(CC(=O)N2CCC(CC2)NC(=O)Nc2ccc(OC(F)(F)F)cc2)CC1
: