Target
Bifunctional epoxide hydrolase 2
Ligand
BDBM50327814
Substrate
Meas. Tech.
ChEMBL_664904 (CHEMBL1259736)
IC50
0.7±n/a nM
Citation
 Rose, TEMorisseau, CLiu, JYInceoglu, BJones, PDSanborn, JRHammock, BD 1-Aryl-3-(1-acylpiperidin-4-yl)urea inhibitors of human and murine soluble epoxide hydrolase: structure-activity relationships, pharmacokinetics, and reduction of inflammatory pain. J Med Chem 53:7067-75 (2010)  
Target
Name:
Bifunctional epoxide hydrolase 2
Synonyms:
Cytosolic epoxide hydrolase 2 EPHX2 HYES_HUMAN Soluble epoxide hydrolase (sEH) | epoxide hydrolase 2, cytoplasmic
Type:
Enzyme
Mol. Mass.:
62613.07
Organism:
Homo sapiens (Human)
Description:
P34913
Residue:
555
  
Inhibitor
Name:
BDBM50327814
Synonyms:
1-(1-Propionylpiperidin-4-yl)-3-(4-(trifluoromethyl)phenyl)urea US9296693, 36
Type:
Small organic molecule
Emp. Form.:
C16H20F3N3O2
Mol. Mass.:
343.3441
SMILES:
CCC(=O)N1CCC(CC1)NC(=O)Nc1ccc(cc1)C(F)(F)F
: