Target
Bifunctional epoxide hydrolase 2
Ligand
BDBM50327845
Substrate
Meas. Tech.
ChEMBL_664906 (CHEMBL1259738)
IC50
0.7±n/a nM
Citation
 Rose, TEMorisseau, CLiu, JYInceoglu, BJones, PDSanborn, JRHammock, BD 1-Aryl-3-(1-acylpiperidin-4-yl)urea inhibitors of human and murine soluble epoxide hydrolase: structure-activity relationships, pharmacokinetics, and reduction of inflammatory pain. J Med Chem 53:7067-75 (2010)  
Target
Name:
Bifunctional epoxide hydrolase 2
Synonyms:
Eph2 Epoxide hydratase Soluble epoxide hydrolase (sEH)
Type:
Enzyme
Mol. Mass.:
62512.06
Organism:
Mus musculus (Mouse)
Description:
P34914
Residue:
554
  
Inhibitor
Name:
BDBM50327845
Synonyms:
1-(4-Perfluoroisopropylphenyl)-3-(1-propionylpiperidin-4-yl)urea US9296693, 38
Type:
Small organic molecule
Emp. Form.:
C18H20F7N3O2
Mol. Mass.:
443.3591
SMILES:
CCC(=O)N1CCC(CC1)NC(=O)Nc1ccc(cc1)C(F)(C(F)(F)F)C(F)(F)F
: