Target
Bifunctional epoxide hydrolase 2
Ligand
BDBM50327844
Substrate
Meas. Tech.
ChEMBL_664906 (CHEMBL1259738)
IC50
1±n/a nM
Citation
 Rose, TEMorisseau, CLiu, JYInceoglu, BJones, PDSanborn, JRHammock, BD 1-Aryl-3-(1-acylpiperidin-4-yl)urea inhibitors of human and murine soluble epoxide hydrolase: structure-activity relationships, pharmacokinetics, and reduction of inflammatory pain. J Med Chem 53:7067-75 (2010)  
Target
Name:
Bifunctional epoxide hydrolase 2
Synonyms:
Eph2 Epoxide hydratase Soluble epoxide hydrolase (sEH)
Type:
Enzyme
Mol. Mass.:
62512.06
Organism:
Mus musculus (Mouse)
Description:
P34914
Residue:
554
  
Inhibitor
Name:
BDBM50327844
Synonyms:
1-(3,5-Dichlorophenyl)-3-(1-propionylpiperidin-4-yl)urea US9296693, 33
Type:
Small organic molecule
Emp. Form.:
C15H19Cl2N3O2
Mol. Mass.:
344.236
SMILES:
CCC(=O)N1CCC(CC1)NC(=O)Nc1cc(Cl)cc(Cl)c1
: