Target
5-hydroxytryptamine receptor 4
Ligand
BDBM50327862
Substrate
Meas. Tech.
ChEMBL_664907 (CHEMBL1259739)
Ki
0.901000±n/a nM
Citation
 Xu, RHong, JMorse, CLPike, VW Synthesis, structure-affinity relationships, and radiolabeling of selective high-affinity 5-HT4 receptor ligands as prospective imaging probes for positron emission tomography. J Med Chem 53:7035-47 (2010)  
Target
Name:
5-hydroxytryptamine receptor 4
Synonyms:
5-HT4 5HT4R_CAVPO Serotonin 4 (5-HT4) receptor
Type:
Enzyme Catalytic Domain
Mol. Mass.:
43735.29
Organism:
GUINEA PIG
Description:
5-HT4 HTR4 GUINEA PIG::O70528
Residue:
388
  
Inhibitor
Name:
BDBM50327862
Synonyms:
(1-Propylpiperidin-4-yl)methyl 4-Amino-3-methoxybenzoate | CHEMBL1258560
Type:
Small organic molecule
Emp. Form.:
C17H26N2O3
Mol. Mass.:
306.3999
SMILES:
CCCN1CCC(COC(=O)c2ccc(N)c(OC)c2)CC1
: