Target
Cytochrome P450 1A2
Ligand
BDBM21360
Substrate
Meas. Tech.
ChEMBL_665567 (CHEMBL1261451)
IC50
500±n/a nM
Citation
 Micheli, FArista, LBertani, BBraggio, SCapelli, AMCremonesi, SDi-Fabio, RGelardi, GGentile, GMarchioro, CPasquarello, AProvera, STedesco, GTarsi, LTerreni, SWorby, AHeidbreder, C Exploration of the amine terminus in a novel series of 1,2,4-triazolo-3-yl-azabicyclo[3.1.0]hexanes as selective dopamine D3 receptor antagonists. J Med Chem 53:7129-39 (2010)  
Target
Name:
Cytochrome P450 1A2
Synonyms:
CP1A2_HUMAN CYPIA2 Cytochrome P(3)450 Cytochrome P450 1A2 (CYP1A2) Cytochrome P450-P3
Type:
Enzyme
Mol. Mass.:
58423.38
Organism:
Homo sapiens (Human)
Description:
P05177
Residue:
516
  
Inhibitor
Name:
BDBM21360
Synonyms:
7-ethoxy-3H-phenoxazin-3-one Ethoxyresorufin | US9216974, Ethoxy-resorufin
Type:
Small organic molecule
Emp. Form.:
C14H11NO3
Mol. Mass.:
241.242
SMILES:
CCOc1ccc2nc3ccc(=O)cc3oc2c1
: