Target
Cathepsin D
Ligand
BDBM50302838
Substrate
Meas. Tech.
ChEMBL_673657 (CHEMBL1274834)
IC50
22±n/a nM
Citation
 Truong, APTóth, GProbst, GDSealy, JMBowers, SWone, DWDressen, DHom, RKKonradi, AWSham, HLWu, JPeterson, BTRuslim, LBova, MPKholodenko, DMotter, RNBard, FSantiago, PNi, HChian, DSoriano, FCole, TBrigham, EFWong, KZmolek, WGoldbach, ESamant, BChen, LZhang, HNakamura, DFQuinn, KPYednock, TASauer, JM Design of an orally efficacious hydroxyethylamine (HEA) BACE-1 inhibitor in a preclinical animal model. Bioorg Med Chem Lett 20:6231-6 (2010)  
Target
Name:
Cathepsin D
Synonyms:
CATD_HUMAN CTSD Cathepsin D heavy chain Cathepsin D precursor
Type:
Enzyme
Mol. Mass.:
44551.72
Organism:
Homo sapiens (Human)
Description:
Human proCathepsin D (SwissProt accession number P07339) was expressed in Sf9 cells, purified, and autoactivated.
Residue:
412
  
Inhibitor
Name:
BDBM50302838
Synonyms:
CHEMBL572081 N-[(1S,2R)-1-(3,5-difluorobenzyl)-2-hydroxy-3-({1-[3-(1H-pyrazol-1-yl)phenyl]cyclohexyl}amino)propyl]acetamide
Type:
Small organic molecule
Emp. Form.:
C27H32F2N4O2
Mol. Mass.:
482.5654
SMILES:
CC(=O)N[C@@H](Cc1cc(F)cc(F)c1)[C@H](O)CNC1(CCCCC1)c1cccc(c1)-n1cccn1
: