Target
PH domain leucine-rich repeat-containing protein phosphatase 2
Ligand
BDBM50328818
Substrate
Meas. Tech.
ChEMBL_673824 (CHEMBL1275001)
IC50
4000±n/a nM
Citation
 Sierecki, ESinko, WMcCammon, JANewton, AC Discovery of small molecule inhibitors of the PH domain leucine-rich repeat protein phosphatase (PHLPP) by chemical and virtual screening. J Med Chem 53:6899-911 (2010)  
Target
Name:
PH domain leucine-rich repeat-containing protein phosphatase 2
Synonyms:
KIAA0931 PHLP2_HUMAN PHLPP2 | PHLPPL
Type:
PROTEIN
Mol. Mass.:
146727.83
Organism:
Homo sapiens (Human)
Description:
ChEMBL_673824
Residue:
1323
  
Inhibitor
Name:
BDBM50328818
Synonyms:
6-methoxy-N-(2-(piperidin-2-yl)ethyl)quinolin-8-amine NSC-13378
Type:
Small organic molecule
Emp. Form.:
C17H23N3O
Mol. Mass.:
285.384
SMILES:
COc1cc(NCCC2CCCCN2)c2ncccc2c1
: