Target
PH domain leucine-rich repeat-containing protein phosphatase 2
Ligand
BDBM50328820
Substrate
Meas. Tech.
ChEMBL_673824 (CHEMBL1275001)
IC50
4000±n/a nM
Citation
 Sierecki, ESinko, WMcCammon, JANewton, AC Discovery of small molecule inhibitors of the PH domain leucine-rich repeat protein phosphatase (PHLPP) by chemical and virtual screening. J Med Chem 53:6899-911 (2010)  
Target
Name:
PH domain leucine-rich repeat-containing protein phosphatase 2
Synonyms:
KIAA0931 PHLP2_HUMAN PHLPP2 | PHLPPL
Type:
PROTEIN
Mol. Mass.:
146727.83
Organism:
Homo sapiens (Human)
Description:
ChEMBL_673824
Residue:
1323
  
Inhibitor
Name:
BDBM50328820
Synonyms:
1-((4-methoxyphenylamino)methyl)naphthalen-2-ol NSC-47924
Type:
Small organic molecule
Emp. Form.:
C18H17NO2
Mol. Mass.:
279.3331
SMILES:
COc1ccc(NCc2c(O)ccc3ccccc23)cc1
: