Target
PH domain leucine-rich repeat-containing protein phosphatase 2
Ligand
BDBM25462
Substrate
Meas. Tech.
ChEMBL_673824 (CHEMBL1275001)
IC50
10000±n/a nM
Citation
 Sierecki, ESinko, WMcCammon, JANewton, AC Discovery of small molecule inhibitors of the PH domain leucine-rich repeat protein phosphatase (PHLPP) by chemical and virtual screening. J Med Chem 53:6899-911 (2010)  
Target
Name:
PH domain leucine-rich repeat-containing protein phosphatase 2
Synonyms:
KIAA0931 PHLP2_HUMAN PHLPP2 | PHLPPL
Type:
PROTEIN
Mol. Mass.:
146727.83
Organism:
Homo sapiens (Human)
Description:
ChEMBL_673824
Residue:
1323
  
Inhibitor
Name:
BDBM25462
Synonyms:
2,3-dinitro-9H-fluoren-9-one | NSC133896
Type:
Small organic molecule
Emp. Form.:
C13H6N2O5
Mol. Mass.:
270.1971
SMILES:
[O-][N+](=O)c1cc2C(=O)c3ccccc3-c2cc1[N+]([O-])=O
: