Target
PH domain leucine-rich repeat-containing protein phosphatase 2
Ligand
BDBM50328823
Substrate
Meas. Tech.
ChEMBL_673824 (CHEMBL1275001)
IC50
10000±n/a nM
Citation
 Sierecki, ESinko, WMcCammon, JANewton, AC Discovery of small molecule inhibitors of the PH domain leucine-rich repeat protein phosphatase (PHLPP) by chemical and virtual screening. J Med Chem 53:6899-911 (2010)  
Target
Name:
PH domain leucine-rich repeat-containing protein phosphatase 2
Synonyms:
KIAA0931 PHLP2_HUMAN PHLPP2 | PHLPPL
Type:
PROTEIN
Mol. Mass.:
146727.83
Organism:
Homo sapiens (Human)
Description:
ChEMBL_673824
Residue:
1323
  
Inhibitor
Name:
BDBM50328823
Synonyms:
5,5'-(3-(pyridin-2-yl)-1,2,4-triazine-5,6-diyl)difuran-2-sulfonic acid NSC-601364
Type:
Small organic molecule
Emp. Form.:
C16H10N4O8S2
Mol. Mass.:
450.403
SMILES:
OS(=O)(=O)c1ccc(o1)-c1nnc(nc1-c1ccc(o1)S(O)(=O)=O)-c1ccccn1
: