Target
PH domain leucine-rich repeat-containing protein phosphatase 2
Ligand
BDBM50328824
Substrate
Meas. Tech.
ChEMBL_673824 (CHEMBL1275001)
IC50
5000±n/a nM
Citation
 Sierecki, ESinko, WMcCammon, JANewton, AC Discovery of small molecule inhibitors of the PH domain leucine-rich repeat protein phosphatase (PHLPP) by chemical and virtual screening. J Med Chem 53:6899-911 (2010)  
Target
Name:
PH domain leucine-rich repeat-containing protein phosphatase 2
Synonyms:
KIAA0931 PHLP2_HUMAN PHLPP2 | PHLPPL
Type:
PROTEIN
Mol. Mass.:
146727.83
Organism:
Homo sapiens (Human)
Description:
ChEMBL_673824
Residue:
1323
  
Inhibitor
Name:
BDBM50328824
Synonyms:
1,3-di(1H-indazol-6-yl)thiourea NSC-74429
Type:
Small organic molecule
Emp. Form.:
C15H12N6S
Mol. Mass.:
308.361
SMILES:
S=C(Nc1ccc2c[nH]nc2c1)Nc1ccc2c[nH]nc2c1
: