Target
PH domain leucine-rich repeat-containing protein phosphatase 2
Ligand
BDBM50328825
Substrate
Meas. Tech.
ChEMBL_673824 (CHEMBL1275001)
IC50
40000±n/a nM
Citation
 Sierecki, ESinko, WMcCammon, JANewton, AC Discovery of small molecule inhibitors of the PH domain leucine-rich repeat protein phosphatase (PHLPP) by chemical and virtual screening. J Med Chem 53:6899-911 (2010)  
Target
Name:
PH domain leucine-rich repeat-containing protein phosphatase 2
Synonyms:
KIAA0931 PHLP2_HUMAN PHLPP2 | PHLPPL
Type:
PROTEIN
Mol. Mass.:
146727.83
Organism:
Homo sapiens (Human)
Description:
ChEMBL_673824
Residue:
1323
  
Inhibitor
Name:
BDBM50328825
Synonyms:
9-benzyl-6-(benzylthio)-9H-purin-2-amine NSC-42384
Type:
Small organic molecule
Emp. Form.:
C19H17N5S
Mol. Mass.:
347.437
SMILES:
Nc1nc(SCc2ccccc2)c2ncn(Cc3ccccc3)c2n1
: