Target
PH domain leucine-rich repeat-containing protein phosphatase 2
Ligand
BDBM50328832
Substrate
Meas. Tech.
ChEMBL_673824 (CHEMBL1275001)
IC50
34000±n/a nM
Citation
 Sierecki, ESinko, WMcCammon, JANewton, AC Discovery of small molecule inhibitors of the PH domain leucine-rich repeat protein phosphatase (PHLPP) by chemical and virtual screening. J Med Chem 53:6899-911 (2010)  
Target
Name:
PH domain leucine-rich repeat-containing protein phosphatase 2
Synonyms:
KIAA0931 PHLP2_HUMAN PHLPP2 | PHLPPL
Type:
PROTEIN
Mol. Mass.:
146727.83
Organism:
Homo sapiens (Human)
Description:
ChEMBL_673824
Residue:
1323
  
Inhibitor
Name:
BDBM50328832
Synonyms:
2-hydroxy-3-((4-(N-pyridin-2-ylsulfamoyl)phenyl)diazenyl)-1-naphthoic acid NSC-134145
Type:
Small organic molecule
Emp. Form.:
C22H16N4O5S
Mol. Mass.:
448.451
SMILES:
OC(=O)c1c(O)c(cc2ccccc12)\N=N\c1ccc(cc1)S(=O)(=O)Nc1ccccn1
: