Target
PH domain leucine-rich repeat-containing protein phosphatase 2
Ligand
BDBM50328842
Substrate
Meas. Tech.
ChEMBL_673824 (CHEMBL1275001)
IC50
83000±n/a nM
Citation
 Sierecki, ESinko, WMcCammon, JANewton, AC Discovery of small molecule inhibitors of the PH domain leucine-rich repeat protein phosphatase (PHLPP) by chemical and virtual screening. J Med Chem 53:6899-911 (2010)  
Target
Name:
PH domain leucine-rich repeat-containing protein phosphatase 2
Synonyms:
KIAA0931 PHLP2_HUMAN PHLPP2 | PHLPPL
Type:
PROTEIN
Mol. Mass.:
146727.83
Organism:
Homo sapiens (Human)
Description:
ChEMBL_673824
Residue:
1323
  
Inhibitor
Name:
BDBM50328842
Synonyms:
2-hydroxy-3-methyl-5-((4-((4-sulfophenyl)diazenyl)phenyl)diazenyl)benzoic acid NSC-326196
Type:
Small organic molecule
Emp. Form.:
C20H16N4O6S
Mol. Mass.:
440.429
SMILES:
Cc1cc(cc(C(O)=O)c1O)N=Nc1ccc(cc1)N=Nc1ccc(cc1)S(O)(=O)=O
: