Target
C-C motif chemokine 5
Ligand
BDBM50329243
Substrate
Meas. Tech.
ChEMBL_675123 (CHEMBL1272914)
IC50
39±n/a nM
Citation
 Wanner, JChen, LLemoine, RCKondru, RJekle, AHeilek, GdeRosier, AJi, CBerry, PWRotstein, DM Evaluation of amide replacements in CCR5 antagonists as a means to increase intrinsic permeability. Part 2: SAR optimization and pharmacokinetic profile of a homologous azacyle series. Bioorg Med Chem Lett 20:6802-7 (2010)  
Target
Name:
C-C motif chemokine 5
Synonyms:
CCL5 D17S136E Eosinophil chemotactic cytokine RANTES(4-68) SIS-delta T cell-specific protein P228 TCP228
Type:
PROTEIN
Mol. Mass.:
9996.11
Organism:
Homo sapiens (Human)
Description:
ChEMBL_1363187
Residue:
91
  
Inhibitor
Name:
BDBM50329243
Synonyms:
((3aR,6aS)-5-(3-(1-(cyclopropylsulfonyl)azetidin-3-yl)-3-(3-fluorophenyl)propyl)hexahydropyrrolo[3,4-c]pyrrol-2(1H)-yl)(4,6-dimethylpyrimidin-5-yl)methanone | CHEMBL1270303
Type:
Small organic molecule
Emp. Form.:
C28H36FN5O3S
Mol. Mass.:
541.681
SMILES:
Cc1ncnc(C)c1C(=O)N1C[C@@H]2CN(CCC(C3CN(C3)S(=O)(=O)C3CC3)c3cccc(F)c3)C[C@@H]2C1
: