Target
C-C motif chemokine 5
Ligand
BDBM50329256
Substrate
Meas. Tech.
ChEMBL_675123 (CHEMBL1272914)
IC50
31±n/a nM
Citation
 Wanner, JChen, LLemoine, RCKondru, RJekle, AHeilek, GdeRosier, AJi, CBerry, PWRotstein, DM Evaluation of amide replacements in CCR5 antagonists as a means to increase intrinsic permeability. Part 2: SAR optimization and pharmacokinetic profile of a homologous azacyle series. Bioorg Med Chem Lett 20:6802-7 (2010)  
Target
Name:
C-C motif chemokine 5
Synonyms:
CCL5 D17S136E Eosinophil chemotactic cytokine RANTES(4-68) SIS-delta T cell-specific protein P228 TCP228
Type:
PROTEIN
Mol. Mass.:
9996.11
Organism:
Homo sapiens (Human)
Description:
ChEMBL_1363187
Residue:
91
  
Inhibitor
Name:
BDBM50329256
Synonyms:
4,6-dimethyl-5-((3aR,6aS)-5-(3-(1-(methylsulfonyl)piperidin-4-yl)-3-phenylpropyl)octahydropyrrolo[3,4-c]pyrrole-2-carbonyl)picolinonitrile | CHEMBL1271208
Type:
Small organic molecule
Emp. Form.:
C30H39N5O3S
Mol. Mass.:
549.727
SMILES:
Cc1cc(nc(C)c1C(=O)N1C[C@@H]2CN(CCC(C3CCN(CC3)S(C)(=O)=O)c3ccccc3)C[C@@H]2C1)C#N
: