Target
Acetylcholinesterase
Ligand
BDBM50329504
Substrate
Meas. Tech.
ChEMBL_674712 (CHEMBL1273965)
IC50
456±n/a nM
Citation
 Huang, LLuo, ZHe, FShi, AQin, FLi, X Berberine derivatives, with substituted amino groups linked at the 9-position, as inhibitors of acetylcholinesterase/butyrylcholinesterase. Bioorg Med Chem Lett 20:6649-52 (2010)  
Target
Name:
Acetylcholinesterase
Synonyms:
ACES_ELEEL Acetylcholinesterase (EeAChE) | ache
Type:
Enzyme
Mol. Mass.:
71812.79
Organism:
Electrophorus electricus (Electric eel)
Description:
Residue:
633
  
Inhibitor
Name:
BDBM50329504
Synonyms:
10-Methoxy-9-(3-morpholin-4-yl-propoxy)-5,6-dihydro-[1,3]dioxolo[4,5-g]isoquino[3,2-a]isoquinolin-7-ylium bromide | CHEMBL1270132
Type:
Small organic molecule
Emp. Form.:
C26H29N2O5
Mol. Mass.:
449.5183
SMILES:
COc1ccc2cc3-c4cc5OCOc5cc4CC[n+]3cc2c1OCCCN1CCOCC1
: