Target
Acetylcholinesterase
Ligand
BDBM50329512
Substrate
Meas. Tech.
ChEMBL_674712 (CHEMBL1273965)
IC50
1740±n/a nM
Citation
 Huang, LLuo, ZHe, FShi, AQin, FLi, X Berberine derivatives, with substituted amino groups linked at the 9-position, as inhibitors of acetylcholinesterase/butyrylcholinesterase. Bioorg Med Chem Lett 20:6649-52 (2010)  
Target
Name:
Acetylcholinesterase
Synonyms:
ACES_ELEEL Acetylcholinesterase (EeAChE) | ache
Type:
Enzyme
Mol. Mass.:
71812.79
Organism:
Electrophorus electricus (Electric eel)
Description:
Residue:
633
  
Inhibitor
Name:
BDBM50329512
Synonyms:
9-(2-Dimethylamino-ethoxy)-10-methoxy-5,6-dihydro-[1,3]dioxolo[4,5-g]isoquino[3,2-a]isoquinolin-7-ylium bromide | CHEMBL1271342
Type:
Small organic molecule
Emp. Form.:
C23H25N2O4
Mol. Mass.:
393.4551
SMILES:
COc1ccc2cc3-c4cc5OCOc5cc4CC[n+]3cc2c1OCCN(C)C
: