Target
Carboxylic ester hydrolase
Ligand
BDBM50329510
Substrate
Meas. Tech.
ChEMBL_674714 (CHEMBL1273967)
IC50
3460±n/a nM
Citation
 Huang, LLuo, ZHe, FShi, AQin, FLi, X Berberine derivatives, with substituted amino groups linked at the 9-position, as inhibitors of acetylcholinesterase/butyrylcholinesterase. Bioorg Med Chem Lett 20:6649-52 (2010)  
Target
Name:
Carboxylic ester hydrolase
Synonyms:
BuChE Butyrylcholine esterase Butyrylcholinesterase (BChE) Butyrylcholinesterase (EqBuChE) butyrylcholinesterase precursor
Type:
Protein
Mol. Mass.:
68842.83
Organism:
Equus caballus (Horse)
Description:
Q9N1N9
Residue:
602
  
Inhibitor
Name:
BDBM50329510
Synonyms:
9-(3-Diethylamino-propoxy)-10-methoxy-5,6-dihydro-[1,3]dioxolo[4,5-g]isoquino[3,2-a]isoquinolin-7-ylium bromide | CHEMBL1271449
Type:
Small organic molecule
Emp. Form.:
C26H31N2O4
Mol. Mass.:
435.5348
SMILES:
CCN(CC)CCCOc1c(OC)ccc2cc3-c4cc5OCOc5cc4CC[n+]3cc12
: