Target
Oligo-1,6-glucosidase IMA1
Ligand
BDBM50329780
Substrate
Meas. Tech.
ChEMBL_674760 (CHEMBL1274068)
Ki
451000±n/a nM
Citation
 Aguilar-Moncayo, MGarcía-Moreno, MIStütz, AEGarcía Fernández, JMWrodnigg, TMOrtiz Mellet, C Fluorescent-tagged sp2-iminosugars with potentß-glucosidase inhibitory activity. Bioorg Med Chem 18:7439-45 (2010)  
Target
Name:
Oligo-1,6-glucosidase IMA1
Synonyms:
α-glucosidase Alpha-glucosidase (α-glucosidase) MALX3_YEAST | Oligo-1,6-glucosidase
Type:
Protein
Mol. Mass.:
68577.59
Organism:
Saccharomyces cerevisiae S288c (Baker's yeast)
Description:
Residue:
589
  
Inhibitor
Name:
BDBM50329780
Synonyms:
5-N,6-S-[N'-[4-(6-Dansylaminohexanamido)butyl]iminomethylidene]-6-thionojirimycin | CHEMBL1269790
Type:
Small organic molecule
Emp. Form.:
C28H43N5O8S3
Mol. Mass.:
673.865
SMILES:
CN(C)c1cccc2c(cccc12)S(=O)(=O)NCCCCCS(=O)(=O)NCCCC\N=C1/SC[C@@H]2[C@@H](O)[C@H](O)[C@@H](O)[C@@H](O)N12
: