Target
Fructose-bisphosphate aldolase A
Ligand
BDBM50330433
Substrate
Meas. Tech.
ChEMBL_684839 (CHEMBL1286069)
IC50
112000±n/a nM
Citation
 Daher, RCoinçon, MFonvielle, MGest, PMGuerin, MEJackson, MSygusch, JTherisod, M Rational design, synthesis, and evaluation of new selective inhibitors of microbial class II (zinc dependent) fructose bis-phosphate aldolases. J Med Chem 53:7836-42 (2010)  
Target
Name:
Fructose-bisphosphate aldolase A
Synonyms:
ALDOA | ALDOA_RABIT
Type:
PROTEIN
Mol. Mass.:
39351.00
Organism:
Oryctolagus cuniculus
Description:
ChEMBL_813854
Residue:
364
  
Inhibitor
Name:
BDBM50330433
Synonyms:
4-{hydroxy[(phosphonooxy)acetyl]amino}butyl dihydrogen phosphate N-(4-hydroxybutyl)-glycolohydroxamicacid bis-phosphate
Type:
Small organic molecule
Emp. Form.:
C6H15NO10P2
Mol. Mass.:
323.1315
SMILES:
ON(CCCCOP(O)(O)=O)C(=O)COP(O)(O)=O
: