Target
Fructose-bisphosphate aldolase
Ligand
BDBM50330436
Substrate
Meas. Tech.
ChEMBL_684841 (CHEMBL1286071)
Ki
400±n/a nM
Citation
 Daher, RCoinçon, MFonvielle, MGest, PMGuerin, MEJackson, MSygusch, JTherisod, M Rational design, synthesis, and evaluation of new selective inhibitors of microbial class II (zinc dependent) fructose bis-phosphate aldolases. J Med Chem 53:7836-42 (2010)  
Target
Name:
Fructose-bisphosphate aldolase
Synonyms:
37 kDa major allergen FBA1 FBPA IgE-binding allergen
Type:
PROTEIN
Mol. Mass.:
39211.38
Organism:
Candida albicans
Description:
ChEMBL_684841
Residue:
359
  
Inhibitor
Name:
BDBM50330436
Synonyms:
2-(hydroxy(3-hydroxypropyl)amino)-2-oxoethyl hydrogen phosphate | CHEMBL1276292
Type:
Small organic molecule
Emp. Form.:
C5H12NO7P
Mol. Mass.:
229.125
SMILES:
OCCCN(O)C(=O)COP(O)(O)=O
: