Target
Fructose-bisphosphate aldolase
Ligand
BDBM50330437
Substrate
Meas. Tech.
ChEMBL_684841 (CHEMBL1286071)
Ki
85000±n/a nM
Citation
 Daher, RCoinçon, MFonvielle, MGest, PMGuerin, MEJackson, MSygusch, JTherisod, M Rational design, synthesis, and evaluation of new selective inhibitors of microbial class II (zinc dependent) fructose bis-phosphate aldolases. J Med Chem 53:7836-42 (2010)  
Target
Name:
Fructose-bisphosphate aldolase
Synonyms:
37 kDa major allergen FBA1 FBPA IgE-binding allergen
Type:
PROTEIN
Mol. Mass.:
39211.38
Organism:
Candida albicans
Description:
ChEMBL_684841
Residue:
359
  
Inhibitor
Name:
BDBM50330437
Synonyms:
1,6-di-O-phosphono-D-fructose CHEMBL1235112
Type:
Small organic molecule
Emp. Form.:
C6H14O12P2
Mol. Mass.:
340.1157
SMILES:
OC(COP(O)(O)=O)[C@@H](O)C(=O)[C@H](O)COP(O)(O)=O
: