Target
Prothrombin
Ligand
BDBM50331670
Substrate
Meas. Tech.
ChEMBL_687650 (CHEMBL1290974)
Ki
0.09±n/a nM
Citation
 Hanessian, SLarsson, AFex, TKnecht, WBlomberg, N Design and synthesis of macrocyclic indoles targeting blood coagulation cascade Factor XIa. Bioorg Med Chem Lett 20:6925-8 (2010)  
Target
Name:
Prothrombin
Synonyms:
Activation peptide fragment 1 Coagulation factor II Prothrombin precursor Thrombin heavy chain | Thrombin light chain
Type:
Protein
Mol. Mass.:
70029.57
Organism:
Homo sapiens (Human)
Description:
P00734
Residue:
622
  
Inhibitor
Name:
BDBM50331670
Synonyms:
CHEMBL1289648
Type:
Small organic molecule
Emp. Form.:
C27H32Cl2N6O2
Mol. Mass.:
543.488
SMILES:
Clc1ccc2CCNCCCNC[C@H](Cc3ccccc3)Nc3ncc(Cl)n(CC(=O)NCc2c1)c3=O
: