Target
CCR2 protein
Ligand
BDBM50331728
Substrate
Meas. Tech.
ChEMBL_687883 (CHEMBL1291447)
IC50
16000±n/a nM
Citation
 Xue, CBWang, AMeloni, DZhang, KKong, LFeng, HGlenn, JHuang, TZhang, YCao, GAnand, RZheng, CXia, MHan, QRobinson, DJStorace, LShao, LLi, MBrodmerkel, CMCovington, MScherle, PDiamond, SYeleswaram, SVaddi, KNewton, RHollis, GFriedman, SMetcalf, B Discovery of INCB3344, a potent, selective and orally bioavailable antagonist of human and murine CCR2. Bioorg Med Chem Lett 20:7473-8 (2010)  
Target
Name:
CCR2 protein
Synonyms:
Type:
PROTEIN
Mol. Mass.:
11788.71
Organism:
Macaca fascicularis
Description:
ChEMBL_687883
Residue:
105
  
Inhibitor
Name:
BDBM50331728
Synonyms:
CHEMBL1289316 | N-(2-((3S,4S)-1-(cis-4-(benzo[d][1,3]dioxol-5-yl)-4-hydroxycyclohexyl)-4-ethoxypyrrolidin-3-ylamino)-2-oxoethyl)-3-(trifluoromethyl)benzamide
Type:
Small organic molecule
Emp. Form.:
C29H34F3N3O6
Mol. Mass.:
577.592
SMILES:
CCO[C@H]1CN(C[C@@H]1NC(=O)CNC(=O)c1cccc(c1)C(F)(F)F)[C@H]1CC[C@](O)(CC1)c1ccc2OCOc2c1
: