Target
Aromatase
Ligand
BDBM50332809
Substrate
Meas. Tech.
ChEMBL_696883 (CHEMBL1639399)
IC50
190±n/a nM
Citation
 Dai, YWang, QZhang, XJia, SZheng, HFeng, DYu, P Molecular docking and QSAR study on steroidal compounds as aromatase inhibitors. Eur J Med Chem 45:5612-20 (2010)  
Target
Name:
Aromatase
Synonyms:
ARO1 CP19A_HUMAN CYP19 CYPXIX Cytochrome P450 19A1 Cytochrome P450-C19 (CYP19) FL cytokine receptor precursor | P-450AROM
Type:
Enzyme
Mol. Mass.:
57888.92
Organism:
Homo sapiens (Human)
Description:
P11511
Residue:
503
  
Inhibitor
Name:
BDBM50332809
Synonyms:
(6S,8R,9S,10R,13S,14S)-6-hydroxy-10,13-dimethyl-2,3,7,8,9,10,11,12,13,14,15,16-dodecahydro-1H-cyclopenta[alpha]phenanthren-17(6H)-one | CHEMBL1629806
Type:
Small organic molecule
Emp. Form.:
C19H28O2
Mol. Mass.:
288.4244
SMILES:
C[C@]12CC[C@H]3[C@@H](C[C@H](O)C4=CCCC[C@]34C)[C@@H]1CCC2=O
: