Target
Bifunctional epoxide hydrolase 2
Ligand
BDBM50333054
Substrate
Meas. Tech.
ChEMBL_690164 (CHEMBL1634184)
IC50
3.3±n/a nM
Citation
 Huang, SXLi, HYLiu, JYMorisseau, CHammock, BD Incorporation of Piperazino Functionality into 1,3-Disubstituted Urea as the Tertiary Pharmacophore Affording Potent Inhibitors of Soluble Epoxide Hydrolase with Improved Pharmacokinetic Properties J Med Chem 53:8376-8386 (2010)  
Target
Name:
Bifunctional epoxide hydrolase 2
Synonyms:
Cytosolic epoxide hydrolase 2 EPHX2 HYES_HUMAN Soluble epoxide hydrolase (sEH) | epoxide hydrolase 2, cytoplasmic
Type:
Enzyme
Mol. Mass.:
62613.07
Organism:
Homo sapiens (Human)
Description:
P34913
Residue:
555
  
Inhibitor
Name:
BDBM50333054
Synonyms:
1-Adamantan-1-yl-3-(3-{4-[4-(toluene-4-sulfonyl)-piperazin-1-yl]-butoxy}-phenyl)-urea | CHEMBL1632487
Type:
Small organic molecule
Emp. Form.:
C32H44N4O4S
Mol. Mass.:
580.781
SMILES:
Cc1ccc(cc1)S(=O)(=O)N1CCN(CCCCOc2cccc(NC(=O)NC34CC5CC(CC(C5)C3)C4)c2)CC1
: