Target
Bifunctional epoxide hydrolase 2
Ligand
BDBM50333058
Substrate
Meas. Tech.
ChEMBL_690164 (CHEMBL1634184)
IC50
20.1±n/a nM
Citation
 Huang, SXLi, HYLiu, JYMorisseau, CHammock, BD Incorporation of Piperazino Functionality into 1,3-Disubstituted Urea as the Tertiary Pharmacophore Affording Potent Inhibitors of Soluble Epoxide Hydrolase with Improved Pharmacokinetic Properties J Med Chem 53:8376-8386 (2010)  
Target
Name:
Bifunctional epoxide hydrolase 2
Synonyms:
Cytosolic epoxide hydrolase 2 EPHX2 HYES_HUMAN Soluble epoxide hydrolase (sEH) | epoxide hydrolase 2, cytoplasmic
Type:
Enzyme
Mol. Mass.:
62613.07
Organism:
Homo sapiens (Human)
Description:
P34913
Residue:
555
  
Inhibitor
Name:
BDBM50333058
Synonyms:
4-{4-[4-(3-Adamantan-1-yl-ureido)-phenoxy]-butyl}-piperazine-1-carboxylic acid tert-butyl ester | CHEMBL1632491
Type:
Small organic molecule
Emp. Form.:
C30H46N4O4
Mol. Mass.:
526.7106
SMILES:
CC(C)(C)OC(=O)N1CCN(CCCCOc2ccc(NC(=O)NC34CC5CC(CC(C5)C3)C4)cc2)CC1
: