Target
Bifunctional epoxide hydrolase 2
Ligand
BDBM50333080
Substrate
Meas. Tech.
ChEMBL_690164 (CHEMBL1634184)
IC50
5.4±n/a nM
Citation
 Huang, SXLi, HYLiu, JYMorisseau, CHammock, BD Incorporation of Piperazino Functionality into 1,3-Disubstituted Urea as the Tertiary Pharmacophore Affording Potent Inhibitors of Soluble Epoxide Hydrolase with Improved Pharmacokinetic Properties J Med Chem 53:8376-8386 (2010)  
Target
Name:
Bifunctional epoxide hydrolase 2
Synonyms:
Cytosolic epoxide hydrolase 2 EPHX2 HYES_HUMAN Soluble epoxide hydrolase (sEH) | epoxide hydrolase 2, cytoplasmic
Type:
Enzyme
Mol. Mass.:
62613.07
Organism:
Homo sapiens (Human)
Description:
P34913
Residue:
555
  
Inhibitor
Name:
BDBM50333080
Synonyms:
1-(3-(4-(4-acetylpiperazin-1-yl)-4-oxobutoxy)phenyl)-3-adamantan-1-ylurea | CHEMBL1632472
Type:
Small organic molecule
Emp. Form.:
C27H38N4O4
Mol. Mass.:
482.615
SMILES:
CC(=O)N1CCN(CC1)C(=O)CCCOc1cccc(NC(=O)NC23CC4CC(CC(C4)C2)C3)c1
: