Target
Envelope glycoprotein gp160
Ligand
BDBM50333269
Substrate
Meas. Tech.
ChEMBL_698261 (CHEMBL1646731)
IC50
>100000±n/a nM
Citation
 Lalonde, JMElban, MACourter, JRSugawara, ASoeta, TMadani, NPrinciotto, AMKwon, YDKwong, PDSchön, AFreire, ESodroski, JSmith, AB Design, synthesis and biological evaluation of small molecule inhibitors of CD4-gp120 binding based on virtual screening. Bioorg Med Chem 19:91-101 (2011)  
Target
Name:
Envelope glycoprotein gp160
Synonyms:
ENV_HV1Y2 Glycoprotein 120 SU TM env gp41
Type:
PROTEIN
Mol. Mass.:
95667.71
Organism:
Human immunodeficiency virus type 1 group M subtype B (isolate YU-2)(HIV-1)
Description:
ChEMBL_698262
Residue:
843
  
Inhibitor
Name:
BDBM50333269
Synonyms:
CHEMBL1645123 | N1-(1-benzoylpiperidin-4-yl)-N2-(4-chloro-3-fluorophenyl)oxalamide
Type:
Small organic molecule
Emp. Form.:
C20H19ClFN3O3
Mol. Mass.:
403.835
SMILES:
Fc1cc(NC(=O)C(=O)NC2CCN(CC2)C(=O)c2ccccc2)ccc1Cl
: