Target
Envelope glycoprotein gp160
Ligand
BDBM50333239
Substrate
Meas. Tech.
ChEMBL_698262 (CHEMBL1646732)
Kd
2100±n/a nM
Citation
 Lalonde, JMElban, MACourter, JRSugawara, ASoeta, TMadani, NPrinciotto, AMKwon, YDKwong, PDSchön, AFreire, ESodroski, JSmith, AB Design, synthesis and biological evaluation of small molecule inhibitors of CD4-gp120 binding based on virtual screening. Bioorg Med Chem 19:91-101 (2011)  
Target
Name:
Envelope glycoprotein gp160
Synonyms:
ENV_HV1Y2 Glycoprotein 120 SU TM env gp41
Type:
PROTEIN
Mol. Mass.:
95667.71
Organism:
Human immunodeficiency virus type 1 group M subtype B (isolate YU-2)(HIV-1)
Description:
ChEMBL_698262
Residue:
843
  
Inhibitor
Name:
BDBM50333239
Synonyms:
CHEMBL1645259 | N1-(4-chloro-3-fluorophenyl)-N2-((1-ethylpyrrolidin-2-yl)methyl)oxalamide
Type:
Small organic molecule
Emp. Form.:
C15H19ClFN3O2
Mol. Mass.:
327.782
SMILES:
CCN1CCCC1CNC(=O)C(=O)Nc1ccc(Cl)c(F)c1
: