Target
Potassium voltage-gated channel subfamily H member 2
Ligand
BDBM50333616
Substrate
Meas. Tech.
ChEMBL_699750 (CHEMBL1648563)
IC50
1.2±n/a nM
Citation
 Haga, YMizutani, SNaya, AKishino, HIwaasa, HIto, MIto, JMoriya, MSato, NTakenaga, NIshihara, ATokita, SKanatani, AOhtake, N Discovery of novel phenylpyridone derivatives as potent and selective MCH1R antagonists. Bioorg Med Chem 19:883-93 (2011)  
Target
Name:
Potassium voltage-gated channel subfamily H member 2
Synonyms:
1,3-beta-glucan synthase component GLS2 ERG Eag-related protein 1 Ether-a-go-go-related gene (HERG) Ether-a-go-go-related gene potassium channel 1 Ether-a-go-go-related gene potassium channel 1 (hERG1) Ether-a-go-go-related protein 1 H-ERG KCNH2 Potassium voltage-gated channel subfamily H member 2 (hERG) Voltage-gated potassium channel subunit Kv11.1 hERG Potassium Channel 1 | putative potassium channel subunit
Type:
Multi-pass membrane protein
Mol. Mass.:
126672.65
Organism:
Homo sapiens (Human)
Description:
Q12809
Residue:
1159
  
Inhibitor
Name:
BDBM50333616
Synonyms:
4-[(4-Methoxybenzyl)oxy]-1-{4-[2-(pyrrolidin-1-yl)-ethoxy]phenyl}pyridin-2(1H)-one | CHEMBL1642476
Type:
Small organic molecule
Emp. Form.:
C25H28N2O4
Mol. Mass.:
420.5008
SMILES:
COc1ccc(COc2ccn(-c3ccc(OCCN4CCCC4)cc3)c(=O)c2)cc1
: