Target
5-hydroxytryptamine receptor 3A
Ligand
BDBM50334447
Substrate
Meas. Tech.
ChEMBL_700634 (CHEMBL1648623)
Ki
2.3±n/a nM
Citation
 Manning, DDCioffi, CLUsyatinsky, AFitzpatrick, KMasih, LGuo, CZhang, ZChoo, SHSikkander, MIRyan, KNNaginskaya, JHassler, CDobritsa, SWierschke, JDEarley, WGButler, ASBrady, CABarnes, NMCohen, MLGuzzo, PR Novel serotonin type 3 receptor partial agonists for the potential treatment of irritable bowel syndrome. Bioorg Med Chem Lett 21:58-61 (2010)  
Target
Name:
5-hydroxytryptamine receptor 3A
Synonyms:
5-HT-3 5-HT3A 5-hydroxytryptamine receptor 3 (5-HT3) 5-hydroxytryptamine receptor 3A (5HT3A) 5HT3R HTR3A Serotonin 3 receptor (5HT3) Serotonin-gated ion channel receptor | Serotonin-gated ion channel receptor 3
Type:
Protein
Mol. Mass.:
55283.27
Organism:
Homo sapiens (Human)
Description:
P46098
Residue:
478
  
Inhibitor
Name:
BDBM50334447
Synonyms:
(S)-2-isopropyl-7-(quinuclidin-3-yl)-7,8-dihydropyrazolo[3,4,5-de]isoquinolin-6(2H)-one US8501729, 7
Type:
Small organic molecule
Emp. Form.:
C19H24N4O
Mol. Mass.:
324.4201
SMILES:
CC(C)n1[nH]c2cn([C@@H]3CN4CCC3CC4)c(=O)c3cccc1c23
: