Target
Sphingosine 1-phosphate receptor 3
Ligand
BDBM50335513
Substrate
Meas. Tech.
ChEMBL_702153 (CHEMBL1655490)
EC50
996±n/a nM
Citation
 Cee, VJFrohn, MLanman, BAGolden, JMuller, KNeira, SPickrell, AArnett, HBuys, JGore, AFiorino, MHorner, MItano, ALee, MRMcElvain, MMiddleton, SSchrag, MRivenzon-Segal, DVargas, HMXu, HXu, YZhang, XSiu, JWong, M Discovery of AMG 369, a Thiazolo[5,4-b]pyridine Agonist of S1P1 and S1P5 ACS Med Chem Lett 2:107-112 (2011)  
Target
Name:
Sphingosine 1-phosphate receptor 3
Synonyms:
C9orf108 EDG3 S1P receptor 3 S1P3 S1PR3_HUMAN Sphingosine 1-phosphate receptor 3 (S1P3) | Sphingosine 1-phosphate receptor Edg-3
Type:
G Protein-Coupled Receptor (GPCR)
Mol. Mass.:
42278.13
Organism:
Homo sapiens (Human)
Description:
Q99500
Residue:
378
  
Inhibitor
Name:
BDBM50335513
Synonyms:
1-((3-fluoro-4-(5-((R)-1-phenylethyl)thiazolo[5,4-b]pyridin-2-yl)phenyl)methyl)azetidine-3-carboxylic acid | CHEMBL1651859
Type:
Small organic molecule
Emp. Form.:
C25H22FN3O2S
Mol. Mass.:
447.524
SMILES:
C[C@H](c1ccccc1)c1ccc2nc(sc2n1)-c1ccc(CN2CC(C2)C(O)=O)cc1F
: