Target
Sphingosine 1-phosphate receptor 3
Ligand
BDBM50335516
Substrate
Meas. Tech.
ChEMBL_702153 (CHEMBL1655490)
EC50
836±n/a nM
Citation
 Cee, VJFrohn, MLanman, BAGolden, JMuller, KNeira, SPickrell, AArnett, HBuys, JGore, AFiorino, MHorner, MItano, ALee, MRMcElvain, MMiddleton, SSchrag, MRivenzon-Segal, DVargas, HMXu, HXu, YZhang, XSiu, JWong, M Discovery of AMG 369, a Thiazolo[5,4-b]pyridine Agonist of S1P1 and S1P5 ACS Med Chem Lett 2:107-112 (2011)  
Target
Name:
Sphingosine 1-phosphate receptor 3
Synonyms:
C9orf108 EDG3 S1P receptor 3 S1P3 S1PR3_HUMAN Sphingosine 1-phosphate receptor 3 (S1P3) | Sphingosine 1-phosphate receptor Edg-3
Type:
G Protein-Coupled Receptor (GPCR)
Mol. Mass.:
42278.13
Organism:
Homo sapiens (Human)
Description:
Q99500
Residue:
378
  
Inhibitor
Name:
BDBM50335516
Synonyms:
1-((3-fluoro-4-(5-(1-phenylcyclohexyl)thiazolo[5,4-b]pyridin-2-yl)phenyl)methyl)azetidine-3-carboxylic acid | CHEMBL1651864
Type:
Small organic molecule
Emp. Form.:
C29H28FN3O2S
Mol. Mass.:
501.615
SMILES:
OC(=O)C1CN(Cc2ccc(-c3nc4ccc(nc4s3)C3(CCCCC3)c3ccccc3)c(F)c2)C1
: